*keyword
*title
beam.k - cantilever beam
*control_termination
*database_binary_d3plot
*database_history_node
*database_nodout
*part
aluminum beam
*section_beam
*mat_elastic
*node
*element_beam
*load_node_point
*define_curve
*end