*keyword
*title
shell.k - bending of shell element
*control_termination
*database_nodout
*database_history_node_set
*database_binary_d3plot
*part
aluminum beam
*section_shell
*mat_elastic
*node
*set_node_list
*set_node_list
*element_shell
*boundary_spc_set
*load_node_set
*define_curve
*end